Technologie de l'identification
type: Concept
definition: Etude, développement, application et considérations éthiques des méthodes technologiques d'identification de produits, d'animaux ou de personnes; y compris la radiofréquence, la biométrie ou la reconnaissance faciale
in scheme: mediatopic
created: 2009-10-22T02:00:00+00:00
modified: 2021-02-18T12:00:00+00:00
broader: http://cv.iptc.org/newscodes/mediatopic/20000756