识别技术
type: Concept
definition: 研究、发展、应用和伦理上考虑鉴别产品、动物或人的技术方法； 包括射频、生物特征识别或人脸识别
in scheme: mediatopic
created: 2009-10-22T02:00:00+00:00
modified: 2021-02-18T12:00:00+00:00
broader: http://cv.iptc.org/newscodes/mediatopic/20000756