information technology and computer science
type: Concept
preferred label: علوم الكمبيوتر/معلوماتية @ar
preferred label: Technologie de l'information et Informatique @fr
preferred label: Tecnología de la información e Informática @es
preferred label: IT/datavetenskap @se
preferred label: Informatik @de
preferred label: tecnologias de informação @pt-pt
preferred label: informationsteknologi og datalogi @dk
preferred label: 信息技术与计算机科学 @zh-hans
preferred label: informatikk @no-nb
preferred label: informasjons- og kommunikasjonsteknologi @no-nn
definition: Vetenskap och design rörande datasystem, mjukvara och nätverk. @se
definition: Untersuchung und Entwurf von Computersystemen, Software und Netzwerken @de
definition: The study and design of computer systems, software and networks
definition: Etude et conception de systèmes informatiques, logiciels et réseaux @fr
definition: El estudio y diseño de sistemas informáticos, software y redes @es
definition: Estudo e desenvolvimento de sistemas computacionais, software e redes. @pt-pt
definition: Videnskab og design relateret til computersystemer, software og netværk. @dk
definition: 计算机系统、软件和网络的研究和设计 @zh-hans
in scheme: mediatopic
created: 2009-10-22T02:00:00+00:00
modified: 2021-02-18T12:00:00+00:00
broader: http://cv.iptc.org/newscodes/mediatopic/20000756
narrower: http://cv.iptc.org/newscodes/mediatopic/20001298