Science des matériaux
type: Concept
definition: Etude de la composition, de la structure et des propriétés des matériaux pour leur utilisation dans l'industrie et la construction
in scheme: mediatopic
created: 2009-10-22T02:00:00+00:00
modified: 2021-02-18T12:00:00+00:00
broader: http://cv.iptc.org/newscodes/mediatopic/20000756