Mikrovetenskap
type: Concept
preferred label: Mikroelektronik @de
preferred label: علم الاحياء الدقيقة @ar
preferred label: Science de l'infiniment petit @fr
preferred label: Microciencias @es
preferred label: micro science @en-gb
preferred label: nanociência @pt-pt
preferred label: mikrovidenskab @dk
preferred label: 微观科学 @zh-hans
preferred label: mikrovitenskap @no-nb
preferred label: mikrovitskap @no-nn
definition: The study of and technologies built at a microscopic scale, such as microbiology or microcomputing @en-gb
definition: Vetenskap och teknik rörande saker byggda i mikroskopisk skala.
definition: Das Studium und die Entwicklung von Technologien im mikroskopischen Maßstab, wie z.B. Mikrobiologie oder Mikrocomputing @de
definition: Etude et technologies construites à l'échelle microscopique, telles que la microbiologie ou la micro-informatique @fr
definition: El estudio y las tecnologías construidas a escala microscópica, como la microbiología o la microcomputación @es
definition: Estudo e tecnologias construídas em escala microscópica, como a microbiologia ou a microcomputação. @pt-pt
definition: Videnskab af og teknologier bygget på mikroskopisk skala, såsom mikrobiologi eller mikrocomputing. @dk
definition: 在微观尺度上建立的研究和技术，如微生物学或微计算 @zh-hans
in scheme: mediatopic
created: 2009-10-22T02:00:00+00:00
modified: 2021-02-18T12:00:00+00:00
broader: http://cv.iptc.org/newscodes/mediatopic/20000756
narrower: http://cv.iptc.org/newscodes/mediatopic/20000766