illegal immigration
type: Concept
preferred label: Inmigrantes ilegales @es
preferred label: Illegala immigranter @se
preferred label: Immigration clandestine @fr
preferred label: Illegale Einwanderung @de
preferred label: متسللون @ar
preferred label: imigrantes ilegais @pt-pt
preferred label: illegal indvandrer @dk
preferred label: 非法移民 @zh-hans
preferred label: ulovlig innvandring @no-nb
preferred label: ulovleg innvandrar @no-nn
definition: Bewegung von Individuen von einem Land in ein anderes auf illegalem Weg @de
definition: The movement of individuals or groups of people from one country to another without legal authorisation from the destination country
definition: Personers rörelse från ett land till ett annat med olagliga medel. @se
definition: Movimentação de indivíduos de um país a outro por meios ilícitos. @pt-pt
definition: Bevægelse af enkeltpersoner fra det ene land til det andet med ulovlige midler. @dk
definition: 通过非法手段将个人从一个国家转移到另一个国家 @zh-hans
definition: The movement of individuals or groups of people from one country to another without legal authorization from the destination country
in scheme: mediatopic
created: 2009-10-22T02:00:00+00:00
modified: 2021-02-18T12:00:00+00:00
broader: http://cv.iptc.org/newscodes/mediatopic/20000771