Religiöse Diskriminierung
type: Concept
preferred label: Discriminación religiosa @es
preferred label: Religiös diskriminering @se
preferred label: تمييز ديني @ar
preferred label: religious discrimination @en-gb
preferred label: Discrimination religieuse @fr
preferred label: discriminação religiosa @pt-pt
preferred label: religiøs diskrimination @dk
preferred label: 宗教歧视 @zh-hans
preferred label: trosdiskriminering @no-nb
preferred label: trusdiskriminering @no-nn
definition: Unfair treatment of individuals or groups of people on the basis of their religious belief @en-gb
definition: Schädigendes Verhalten gegenüber einer anderen Gruppe auf der Grundlage der Religion oder des unterschiedlichen Glaubens
definition: Särbehandling av individer eller grupper på grund av personernas religion. @se
definition: Atitudes hostis ou discriminatórias em relação a outro grupo com base em diferenças de crença ou fé. @pt-pt
definition: Skadelige holdninger til en anden gruppe baseret på religiøs overbevisning. @dk
definition: 基于信仰或信仰的不同，一个群体对另一个或多个群体的有害态度 @zh-hans
in scheme: mediatopic
created: 2009-10-22T02:00:00+00:00
modified: 2021-02-18T12:00:00+00:00
broad match: http://cv.iptc.org/newscodes/subjectcode/14025003
broader: http://cv.iptc.org/newscodes/mediatopic/20000775