abusive behaviour
type: Concept
preferred label: سلوك غير لائق @ar
preferred label: Harcèlement @fr
preferred label: Conducta abusiva @es
preferred label: Kränkande beteende @se
preferred label: Misshandlung @de
preferred label: maus-tratos @pt-pt
preferred label: stødende eller krænkende opførsel @dk
preferred label: 虐待行为 @zh-hans
preferred label: overgrep @no-nb
preferred label: abusive behavior
definition: Att behandla en eller flera personer nedsättande genom att angripa den personliga hedern i ord eller genom handling. @se
definition: Actions that intentionally harm another person or people, often on an ongoing basis, such as psychological or mental abuse, negligence, physical or sexual abuse and torture
definition: Die Misshandlung einer oder mehrerer Individuen durch andere, durch unmenschliche Behandlung, sexuelle und mentale Beleidigungen, Entzug von Sinneswahrnehmungen und körperlichen Bedürfnissen, körperliche Misshandlung wie Schläge mit eingeschlossen, oder andere Formen der Folter @de
definition: Comportamento violento ou cruel contra um ou mais indivíduos, através de tratamento desumano, incluindo abuso sexual ou mental, privação de sentidos, de necessidades físicas, abusos físicos, incluindo espancamentos e outras formas de tortura. @pt-pt
definition: At behandle en eller flere personer nedsættende ved at angribe dem i ord eller gennem handling. @dk
definition: 一人或多人受到他人的虐待，包括性虐待或精神虐待、剥夺感官能力，剥夺生理需要、包括殴打在内的身体虐待和其他形式的酷刑 @zh-hans
in scheme: mediatopic
created: 2009-10-22T02:00:00+00:00
modified: 2021-02-18T12:00:00+00:00
broader: http://cv.iptc.org/newscodes/mediatopic/20000802