奴役
type: Concept
definition: 男子、妇女和儿童在法定刑事犯监禁之外的非自愿劳役，包括非自愿无偿劳动、胁迫行为、童工
in scheme: mediatopic
created: 2009-10-22T02:00:00+00:00
modified: 2021-02-18T12:00:00+00:00
broader: http://cv.iptc.org/newscodes/mediatopic/20000802