eutanasi
type: Concept
preferred label: قتل رحيم @ar
preferred label: Sterbehilfe @de
preferred label: Euthanasie @fr
preferred label: Eutanasia @es
preferred label: euthanasia @en-gb
preferred label: Dödshjälp @se
preferred label: eutanásia @pt-pt
preferred label: aktiv dødshjælp @dk
preferred label: 安乐死 @zh-hans
definition: Medvetet påskyndande av annan persons död vid hopplös sjukdom. @se
definition: Unterstützung des Sterbens einer kranken Person @de
definition: The practice of humanely ending the life of a person suffering from a terminal illness @en-gb
definition: Ajuda à morte de uma pessoa com uma doença terminal. @pt-pt
definition: Bevidst hjælp til en anden persons død i håbløs sygdom. @dk
definition: 协助绝症病人的死亡 @zh-hans
definition: Det å ta livet av ein nokon på oppmoding frå personen sjølv.
definition: Det å ta livet av en person etter personens frivillige forespørsel.
in scheme: mediatopic
created: 2009-10-22T02:00:00+00:00
modified: 2021-02-18T12:00:00+00:00
broader: http://cv.iptc.org/newscodes/mediatopic/20000810
narrower: http://cv.iptc.org/newscodes/mediatopic/20000812