suicídio
type: Concept
preferred label: Suicide @fr
preferred label: Suicidio @es
preferred label: انتحار @ar
preferred label: Självmord @se
preferred label: suicide @en-gb
preferred label: Selbstmord @de
preferred label: selvmord @dk
preferred label: 自杀 @zh-hans
preferred label: sjølvmord @no-nn
definition: Avsiktlig självdestruktiv handling som leder till döden. @se
definition: The intentional taking of one's own life @en-gb
definition: Tod durch die eigene Hand @de
definition: Morte de uma pessoa pelos seus próprios meios.
definition: Morte de uma pessoa por suas próprias mãos.
definition: Forsætlig selvdestruktiv handling, der fører til død. @dk
definition: 自愿结束自己性命 @zh-hans
in scheme: mediatopic
created: 2009-10-22T02:00:00+00:00
modified: 2021-02-18T12:00:00+00:00
broader: http://cv.iptc.org/newscodes/mediatopic/20000810