pornografia
type: Concept
preferred label: Pornografi @se
preferred label: اباحة @ar
preferred label: Pornografía @es
preferred label: pornography @en-gb
preferred label: Pornographie @fr
preferred label: Pornografie @de
preferred label: pornografi @dk
preferred label: 色情 @zh-hans
definition: Texter eller bilder som beskriver sex på ett sådant sätt att den som läser eller tittar på bilderna ska bli sexuellt upphetsad. @se
definition: The depiction of sexually explicit acts in various media renditions, such as video or photos, often considered obscene or immoral @en-gb
definition: Akustische oder bildliche Darstellungen von verschiedenartigen im Zusammenhang mit Sexualität stehenden Taten, außerhalb der gesellschaftlich akzeptierten Normen @de
definition: Representações visuais, audiovisuais ou textuais de vários atos relacionados com sexo e considerados fora dos padrões aceites pela comunidade.
definition: Representações visuais, audiovisuais ou textuais de vários atos relacionados ao sexo e considerados fora dos padrões aceitos pela comunidade.
definition: Tekster eller billeder, der beskriver sex på en sådan måde, at enhver, der læser eller ser på billederne, skal være seksuelt ophidset. @dk
definition: 在公认的社会标准之外，对各种与性有关的行为进行音频、视频或文本描述。 @zh-hans
in scheme: mediatopic
created: 2009-10-22T02:00:00+00:00
modified: 2021-02-18T12:00:00+00:00
broader: http://cv.iptc.org/newscodes/mediatopic/20000808