disciplina de competição
type: Concept
preferred label: Deportes de competición @es
preferred label: Disziplin @de
preferred label: رياضة تنافسية @ar
preferred label: Discipline @fr
preferred label: Tävlingsidrott @se
preferred label: competition discipline @en-gb
preferred label: sportsgren @dk
preferred label: 竞争规则 @zh-hans
preferred label: idrettsgren @no-nb
definition: Different types of sport which can be executed in competitions @en-gb
definition: De sporter där det sker tävlingar. @se
definition: Verschiedene Arten von Sport, die in Wettkämpfen ausgetragen werden können @de
definition: Diferentes tipos de desportos que podem ser executados em competições.
definition: Diferentes tipos de esportes que podem ser executados em competições.
definition: Forskellige sportsgrene, der kan udføres i konkurrencer. @dk
definition: 可在比赛中进行的不同类型的运动 @zh-hans
in scheme: mediatopic
created: 2009-10-22T02:00:00+00:00
modified: 2021-02-18T12:00:00+00:00
broader: http://cv.iptc.org/newscodes/mediatopic/15000000
narrower: http://cv.iptc.org/newscodes/mediatopic/20000823
narrower: http://cv.iptc.org/newscodes/mediatopic/20000824
narrower: http://cv.iptc.org/newscodes/mediatopic/20000827
narrower: http://cv.iptc.org/newscodes/mediatopic/20000846
narrower: http://cv.iptc.org/newscodes/mediatopic/20000847
narrower: http://cv.iptc.org/newscodes/mediatopic/20000848
narrower: http://cv.iptc.org/newscodes/mediatopic/20000849
narrower: http://cv.iptc.org/newscodes/mediatopic/20000851
narrower: http://cv.iptc.org/newscodes/mediatopic/20000852
narrower: http://cv.iptc.org/newscodes/mediatopic/20000853
narrower: http://cv.iptc.org/newscodes/mediatopic/20000854
narrower: http://cv.iptc.org/newscodes/mediatopic/20000855
narrower: http://cv.iptc.org/newscodes/mediatopic/20000856
narrower: http://cv.iptc.org/newscodes/mediatopic/20000875
narrower: http://cv.iptc.org/newscodes/mediatopic/20000876
narrower: http://cv.iptc.org/newscodes/mediatopic/20000877
narrower: http://cv.iptc.org/newscodes/mediatopic/20000883
narrower: http://cv.iptc.org/newscodes/mediatopic/20000884
narrower: http://cv.iptc.org/newscodes/mediatopic/20000887
narrower: http://cv.iptc.org/newscodes/mediatopic/20000888
narrower: http://cv.iptc.org/newscodes/mediatopic/20000889
narrower: http://cv.iptc.org/newscodes/mediatopic/20000890
narrower: http://cv.iptc.org/newscodes/mediatopic/20000892
narrower: http://cv.iptc.org/newscodes/mediatopic/20000911
narrower: http://cv.iptc.org/newscodes/mediatopic/20000912
narrower: http://cv.iptc.org/newscodes/mediatopic/20000913
narrower: http://cv.iptc.org/newscodes/mediatopic/20000918
narrower: http://cv.iptc.org/newscodes/mediatopic/20000919
narrower: http://cv.iptc.org/newscodes/mediatopic/20000922
narrower: http://cv.iptc.org/newscodes/mediatopic/20000923
narrower: http://cv.iptc.org/newscodes/mediatopic/20000929
narrower: http://cv.iptc.org/newscodes/mediatopic/20000933
narrower: http://cv.iptc.org/newscodes/mediatopic/20000934
narrower: http://cv.iptc.org/newscodes/mediatopic/20000936
narrower: http://cv.iptc.org/newscodes/mediatopic/20000937
narrower: http://cv.iptc.org/newscodes/mediatopic/20000938
narrower: http://cv.iptc.org/newscodes/mediatopic/20000939
narrower: http://cv.iptc.org/newscodes/mediatopic/20000940
narrower: http://cv.iptc.org/newscodes/mediatopic/20000942
narrower: http://cv.iptc.org/newscodes/mediatopic/20000958
narrower: http://cv.iptc.org/newscodes/mediatopic/20000959
narrower: http://cv.iptc.org/newscodes/mediatopic/20000960
narrower: http://cv.iptc.org/newscodes/mediatopic/20000964
narrower: http://cv.iptc.org/newscodes/mediatopic/20000965
narrower: http://cv.iptc.org/newscodes/mediatopic/20000967
narrower: http://cv.iptc.org/newscodes/mediatopic/20000968
narrower: http://cv.iptc.org/newscodes/mediatopic/20000978
narrower: http://cv.iptc.org/newscodes/mediatopic/20000979
narrower: http://cv.iptc.org/newscodes/mediatopic/20000986
narrower: http://cv.iptc.org/newscodes/mediatopic/20000987
narrower: http://cv.iptc.org/newscodes/mediatopic/20000988
narrower: http://cv.iptc.org/newscodes/mediatopic/20000989
narrower: http://cv.iptc.org/newscodes/mediatopic/20000990
narrower: http://cv.iptc.org/newscodes/mediatopic/20000991
narrower: http://cv.iptc.org/newscodes/mediatopic/20000998
narrower: http://cv.iptc.org/newscodes/mediatopic/20001010
narrower: http://cv.iptc.org/newscodes/mediatopic/20001011
narrower: http://cv.iptc.org/newscodes/mediatopic/20001013