田径
type: Concept
definition: 包括竞走、赛跑、跳跃和投掷的比赛，这些比赛可以在体育场内的跑道上进行，也可以在室外道路上进行
in scheme: mediatopic
created: 2009-10-22T02:00:00+00:00
modified: 2021-05-05T12:00:00+00:00
broader: http://cv.iptc.org/newscodes/mediatopic/20000822