Höjdhopp
type: Concept
preferred label: قفز عالي @ar
preferred label: Hochsprung @de
preferred label: high jump @en-gb
preferred label: Saut en hauteur @fr
preferred label: Salto de altura @es
preferred label: salto em altura @pt-pt
preferred label: højdespring @dk
preferred label: 跳高 @zh-hans
preferred label: høydehopp @no-nb
preferred label: høgdehopp @no-nn
definition: De tävlande försöker hoppa över en horisontell pinne som vilar på ett stativ.
definition: Competitors build up speed over a short sprint and then jump as high as possible over a horizontal bar @en-gb
definition: Wettkämpfer springen so hoch wie möglich über eine Latte, die höher gehängt wird, wenn eine Höhe erreicht ist @de
definition: Prova em que os atletas saltam o mais alto possível sobre uma barra horizontal, que é subida a cada ronda de saltos. Ganha quem atingir a marca mais alta. @pt-pt
definition: Konkurrenterne opbygger hastigheden over en kort sprint og springer så højt som muligt over en vandret bjælke. @dk
definition: 选手短距助跑后尽可能高地跳过横杆 @zh-hans
in scheme: mediatopic
created: 2009-10-22T02:00:00+00:00
modified: 2021-02-18T12:00:00+00:00
broader: http://cv.iptc.org/newscodes/mediatopic/20000827