铅球
type: Concept
definition: 赛手站在2.13米直径的圆圈内投掷一个7.25公斤（男子）或4公斤（女子）的金属球。投掷最远者获胜
in scheme: mediatopic
created: 2009-10-22T02:00:00+00:00
modified: 2021-02-18T12:00:00+00:00
broader: http://cv.iptc.org/newscodes/mediatopic/20000827