triplo salto
type: Concept
preferred label: Dreisprung @de
preferred label: Triple saut @fr
preferred label: Tresteg @se
preferred label: triple jump @en-gb
preferred label: وثبة ثلاثية @ar
preferred label: Triple salto @es
preferred label: salto triplo
preferred label: trespring @dk
preferred label: 三级跳远 @zh-hans
preferred label: tresteg @no-nb
definition: En variant av längdhopp där de tävlande får ta tre steg efter avstamp från hoppbrädan. @se
definition: Wettkämpfer beschleunigen ihre Geschwindigkeit über eine kurze Distanz und versuchen dann so weit wie möglich zu springen, wobei sie einen Hop, einen Step und einen Jump benutzen @de
definition: Competitors build up speed over a short sprint and then attempt to jump as far forward as they can using a hop, skip and a jump technique. @en-gb
definition: Prova em que os atletas fazem uma corrida curta para ganhar velocidade até um ponto determinado e depois se impulsionam encadeando três saltos sucessivos que terminam com uma queda sobre uma caixa de areia. Ganha quem fizer o salto mais longo.
definition: En variant af længdespring, hvor deltagerne får lov til at tage et hop, et skridt og et spring. @dk
definition: 参赛者通过短距离加速助跑，然后利用单足跳、跨跳和跳跃技术尽可能地向前跳出最远的距离 @zh-hans
in scheme: mediatopic
created: 2009-10-22T02:00:00+00:00
modified: 2021-02-18T12:00:00+00:00
broader: http://cv.iptc.org/newscodes/mediatopic/20000827