三级跳远
type: Concept
definition: 参赛者通过短距离加速助跑，然后利用单足跳、跨跳和跳跃技术尽可能地向前跳出最远的距离
in scheme: mediatopic
created: 2009-10-22T02:00:00+00:00
modified: 2021-02-18T12:00:00+00:00
broader: http://cv.iptc.org/newscodes/mediatopic/20000827