室外冰球
type: Concept
definition: 户外冰上运动。冰球场大小和足球场相近。冰鞋和正常冰球使用的类似。使用一个小的硬球进行比赛。选手们的球杆类似于冰球所用，但比一般冰球用的短、圆
in scheme: mediatopic
created: 2009-10-22T02:00:00+00:00
modified: 2021-02-18T12:00:00+00:00
broader: http://cv.iptc.org/newscodes/mediatopic/20000822