棒球
type: Concept
definition: 在封闭的场地上进行的每队九人两只队伍的比赛。得分最高的球队获胜。当一个球员绕着由四个垒标注的场地跑完一圈时，就可以得分。要做到这一点，他必须击中对手向他投掷的球
in scheme: mediatopic
created: 2009-10-22T02:00:00+00:00
modified: 2021-02-18T12:00:00+00:00
broader: http://cv.iptc.org/newscodes/mediatopic/20000822