basquetebol
type: Concept
preferred label: Basket-ball @fr
preferred label: سلة @ar
preferred label: Basketball @de
preferred label: basketball @en-gb
preferred label: Basket @se
preferred label: Básquetbol @es
preferred label: basquete
preferred label: 篮球 @zh-hans
definition: Spiel zwischen zwei Teams mit 5 Spielern - Punkte werden gemacht in dem man einen großen aufgepumpten Ball in einen Korb wirft, der 3.05 Meter über dem Boden hängt @de
definition: Match mellan två femmannalag där de passar en boll och försöker pricka en fast korg med nät som sitter 3,05 meter över marken. @se
definition: Game played between two teams of five - points are scored by placing the large inflated ball into a net fixed on a ring 3.05m above the ground. @en-gb
definition: Jogo disputado entre duas equipas de 5 jogadores. Pontos são marcados quando uma bola é encestada num aro com rede, que se encontra a uma altura de 3.05m do solo.
definition: Jogo disputado entre duas equipes de 5 jogadores. Pontos são marcados quando uma bola é encestada num aro com rede, que se encontra a uma altura de 3.05m do solo.
definition: Basketball spilles mellem to hold af fem. Point scores ved at placere den store bold i et net, der er fastgjort på en ring 3,05 m over jorden. @dk
definition: 集体球类运动。两队比赛，每队5人。运动员将球投入对方离地3.05米高的篮网内得分 @zh-hans
in scheme: mediatopic
created: 2009-10-22T02:00:00+00:00
modified: 2021-02-18T12:00:00+00:00
broader: http://cv.iptc.org/newscodes/mediatopic/20000822