雪橇
type: Concept
definition: 在有舵雪橇比赛中，两到四个人坐在雪橇上滑下一条赛道，雪橇由主船体、框架、两个车轴和一组运动员组成。比赛中所有预赛的总时间加在一起来决定获胜者
in scheme: mediatopic
created: 2009-10-22T02:00:00+00:00
modified: 2022-02-03T12:00:00+00:00
broader: http://cv.iptc.org/newscodes/mediatopic/20000822