拳击
type: Concept
definition: 技击运动。2名男或女选手在一个边长6米的正方形拳击圈内，使用戴着拳套的拳头击打对方。比赛一般分12轮。每轮3分钟
in scheme: mediatopic
created: 2009-10-22T02:00:00+00:00
modified: 2021-02-18T12:00:00+00:00
has facet: weightclasstype
broader: http://cv.iptc.org/newscodes/mediatopic/20000822