板球
type: Concept
definition: 对抗性球类运动，包括两队各11名球员，球、球棒和三柱门。目标是尽可能多地通过“跑动”得分，让对手出局。“跑动”是指球员在两个三柱门之间跑动。每方球队都试图让对手“出局”
in scheme: mediatopic
created: 2009-10-22T02:00:00+00:00
modified: 2021-02-18T12:00:00+00:00
broader: http://cv.iptc.org/newscodes/mediatopic/20000822