individual pursuit (cycling)
type: Concept
preferred label: Poursuite individuelle @fr
preferred label: Persecución individual @es
preferred label: Förföljelselopp, individuellt @se
preferred label: مطاردة فردية @ar
preferred label: Einzelverfolgung (Radsport) @de
preferred label: perseguição individual (ciclismo) @pt-pt
preferred label: individuelt forfølgelsesløb @dk
preferred label: 个人追逐赛 @zh-hans
preferred label: forfølgelsesritt (sykling) @no-nb
preferred label: forfølgingsritt @no-nn
definition: Track cycling event where two cyclists set off from midway down opposite straights and try to make up the gap between them
definition: Tävlande startar på motsatt sida av rundbanan. Om någon hinner ikapp motståndaren är loppet slut, annars vinner bästa tid. @se
definition: Zwei Radfahrer oder Teams starten von zwei Seiten gegenüber und versuchen die Lücke zwischen sich aufzuholen @de
definition: Dois ciclistas partem de pontos médios opostos de uma pista e tentam recuperar a distância entre eles. @pt-pt
definition: Konkurrenterne starter på hver sin side af cykelbanen. Hvis nogen henter modstanderen, er løbet forbi, ellers vinder den bedste tid. @dk
definition: 两名选手各自从对面赛道直道的中间位置出发，努力缩短与对方间距的赛道自行车赛 @zh-hans
note: Retired. Use Media Topic cycling +sports facets racetype + teamsize
in scheme: mediatopic
created: 2009-10-22T02:00:00+00:00
modified: 2021-02-18T12:00:00+00:00
retired: 2017-07-04T12:00:00+00:00
broader: http://cv.iptc.org/newscodes/mediatopic/20000892