dog racing
type: Concept
preferred label: Course de chiens @fr
preferred label: Hunderennen @de
preferred label: Hundsport @se
preferred label: سباق كلاب @ar
preferred label: Carreras de perros @es
preferred label: corrida de cães @pt-pt
preferred label: hundeløb @dk
preferred label: 赛狗 @zh-hans
preferred label: hundeløp @no-nb
definition: Dogs racing around a track
definition: Samlingsbegrepp för tävlingar där hundar springer ikapp runt en bana. @se
definition: Hunderennen über eine vorgeschriebene Distanz @de
definition: Corrida de cães à volta de uma pista. @pt-pt
definition: Samlingskoncept til konkurrencer, hvor hunde løber rundt på en bane. @dk
definition: 狗沿赛道进行的赛跑 @zh-hans
in scheme: mediatopic
created: 2009-10-22T02:00:00+00:00
modified: 2021-02-18T12:00:00+00:00
broader: http://cv.iptc.org/newscodes/mediatopic/20000822
narrower: http://cv.iptc.org/newscodes/mediatopic/20000920
narrower: http://cv.iptc.org/newscodes/mediatopic/20000921
has facet: dogracingtype