duatlo
type: Concept
preferred label: Duathlon @fr
preferred label: Duatlón @es
preferred label: duathlon @en-gb
preferred label: دواثلون @ar
preferred label: 铁人两项 @zh-hans
preferred label: duatlon @no-nb
definition: Sportliches Ereignis, beinhaltet Laufen und Radfahren @de
definition: Tävlingsgren innehållande löpning och cykling. @se
definition: An athletic event involving running and cycling @en-gb
definition: Evento desportivo que envolve corrida a pé e ciclismo.
definition: Evento esportivo que envolve corrida a pé e ciclismo.
definition: Konkurrencegren, som indeholder løb og cykling. @dk
definition: 包括跑步和自行车的运动项目 @zh-hans
definition: Uthaldsgrein som består av ein løpsetappe, ein sykkeletappe og ein ny løpsetappe. @no-nn
definition: Utholdenhetsgren som består av en løpsetappe, en sykkeletappe og en ny løpsetappe. @no-nb
in scheme: mediatopic
created: 2009-10-22T02:00:00+00:00
modified: 2021-02-18T12:00:00+00:00
broader: http://cv.iptc.org/newscodes/mediatopic/20000822