esgrima
type: Concept
preferred label: Escrime @fr
preferred label: Fechten @de
preferred label: Fäktning @se
preferred label: fencing @en-gb
preferred label: مبارزة @ar
preferred label: Esgrima @es
preferred label: fægtning @dk
preferred label: 击剑 @zh-hans
preferred label: fekting @no-nb
definition: Kampfsport mit Schwert oder Florett @de
definition: Match mellan två tävlande som är utrustade med sabel, florett eller värja. Träffar på motståndaren registreras elektriskt. @se
definition: Combat sport using a sword or foil. @en-gb
definition: Desporto de combate que usa espada, florete ou sabre.
definition: Esporte de combate que usa espada, florete ou sabre.
definition: Kamp mellem to konkurrenter, der er udstyret med sabel, fleuret eller kårde. Træf på modstanderen registreres elektrisk. @dk
definition: 使用剑或花剑的一种格斗比赛 @zh-hans
in scheme: mediatopic
created: 2009-10-22T02:00:00+00:00
modified: 2021-02-18T12:00:00+00:00
broader: http://cv.iptc.org/newscodes/mediatopic/20000822
narrower: http://cv.iptc.org/newscodes/mediatopic/20000930
narrower: http://cv.iptc.org/newscodes/mediatopic/20000931
narrower: http://cv.iptc.org/newscodes/mediatopic/20000932
has facet: fencingtype