拳球
type: Concept
definition: 又译拳击球、浮士德球。男子集体运动。类似排球。球网比排球低很多，多在体操俱乐部进行
in scheme: mediatopic
created: 2009-10-22T02:00:00+00:00
modified: 2021-02-18T12:00:00+00:00
broader: http://cv.iptc.org/newscodes/mediatopic/20000822