爱尔兰式橄榄球
type: Concept
definition: 这是一支两队各15人组成的橄榄球队，他们在球场上通过跑动，踢球，传球进行对抗。 通过把球穿过球门柱之间来得分。 由盖尔运动协会管理
in scheme: mediatopic
created: 2009-10-22T02:00:00+00:00
modified: 2021-02-18T12:00:00+00:00
broader: http://cv.iptc.org/newscodes/mediatopic/20000822
broad match: http://cv.iptc.org/newscodes/subjectcode/15000000