高尔夫
type: Concept
definition: 这是一项用不同球杆击打小型硬球进洞的比赛，比赛一轮通常有18个球洞，距离不等。 胜负取决于评分公式，目标是用最少的杆数完成进洞
in scheme: mediatopic
created: 2009-10-22T02:00:00+00:00
modified: 2021-02-18T12:00:00+00:00
broader: http://cv.iptc.org/newscodes/mediatopic/20000822