trampoline
type: Concept
preferred label: Trampolin @se
preferred label: Trampoline @fr
preferred label: Trampolín @es
preferred label: ترامبولين @ar
preferred label: Trampolin (Rhythmische Gymnastik) @de
preferred label: trampolim @pt-pt
preferred label: trampolin @dk
preferred label: 蹦床 @zh-hans
definition: Wettkämpfer zeigen komplizierte Drehungen und Sprünge während sie auf dem Trampolin springen @de
definition: De tävlande ska hoppa på en en studsmatta och på den utföra tio stycken övningar (trick) i följd. Bedöms av domare. @se
definition: Competitors perform complicated twists and turns whilst bouncing on the trampoline.
definition: Os ginastas executam movimentos e acrobacias saltando sobre um trampolim. @pt-pt
definition: Konkurrenterne hopper på en trampolin og udfører ti på hinanden følgende øvelser (tricks) i rækkefølge. Bedømt af dommere. @dk
definition: 运动员在绷床上蹦跳时做复杂的扭转和翻腾动作 @zh-hans
definition: Competitors perform complicated twists and turns while bouncing on the trampoline.
in scheme: mediatopic
created: 2009-10-22T02:00:00+00:00
modified: 2021-02-18T12:00:00+00:00
broader: http://cv.iptc.org/newscodes/mediatopic/20000942