salto de cavalo
type: Concept
preferred label: Saut de cheval @fr
preferred label: Hopp @se
preferred label: Salto con apoyo (gimnasia artística) @es
preferred label: vault (artistic gymnastics) @en-gb
preferred label: منصة القفز @ar
preferred label: Pferdsprung (Kunstturnen) @de
preferred label: salto
preferred label: spring over hest @dk
preferred label: 跳马（竞技体操） @zh-hans
preferred label: hopp @no-nb
definition: Gymnasts propel themselves by jumping on a trampoline after running quickly down a 25m lane @en-gb
definition: Turner bringt sich selbst in die Luft durch Abspringen von einem Brett nach einem schellen Lauf von 25 Metern @de
definition: Os ginastas ganham impulso saltando sobre um trampolim e uma espécie de mesa após corrida acelerada em pista de 25m.
definition: Deltageren løber hen mod *hesten*, hvor han eller hun med hjælp fra en springplade sætter af med fødderne, slår an mod hesten og derefter lander på den anden side af hesten efter at have udført en eller flere akrobatiske vendinger i luften. @dk
definition: 运动员通过25米长的跑道助跑后再踏上跳板腾空跳跃 @zh-hans
in scheme: mediatopic
created: 2009-10-22T02:00:00+00:00
modified: 2021-12-21T12:00:00+00:00
retired: 2015-02-24T12:00:00+00:00
broader: http://cv.iptc.org/newscodes/mediatopic/20001152