爱尔兰式曲棍球
type: Concept
definition: 集体球类运动。15人一队，两队用一根弯曲的木棍进行比赛。 目标是通过击打小球越过对方带有横梁的门柱之间得分，击过横梁上或由一名守门员守卫的横梁下的网中均可得分。
in scheme: mediatopic
created: 2009-10-22T02:00:00+00:00
modified: 2021-02-18T12:00:00+00:00
broad match: http://cv.iptc.org/newscodes/subjectcode/15000000
broader: http://cv.iptc.org/newscodes/mediatopic/20000822