长曲棍球
type: Concept
definition: 又译袋棍球、棍网球或兜网球。两支球队的比赛，每名球员戴着头盔，穿防护服，试图用一根带兜网的球棍和一个硬球得分超过对方
in scheme: mediatopic
created: 2009-10-22T02:00:00+00:00
modified: 2021-02-18T12:00:00+00:00
broader: http://cv.iptc.org/newscodes/mediatopic/20000822