F3000赛车
type: Concept
definition: 发动机马力比一级方程式低。每个赛季，专门的参赛队在各地不同的赛道上比赛，按个人和团队计名次
in scheme: mediatopic
created: 2009-10-22T02:00:00+00:00
retired: 2017-07-04T12:00:00+00:00
modified: 2021-02-18T12:00:00+00:00
broader: http://cv.iptc.org/newscodes/mediatopic/20000991