orientação em esqui
type: Concept
definition: Corrida individual de esqui contrarrelógio em percurso assinalado por marcas. O atleta, que prossegue com a ajuda de bússola e mapa, tem que procurar e encontrar as marcas segundo determinada ordem.
in scheme: mediatopic
created: 2009-10-22T02:00:00+00:00
modified: 2021-02-18T12:00:00+00:00
broader: http://cv.iptc.org/newscodes/mediatopic/20001011