fallskjermhopping (presisjon)
type: Concept
preferred label: Fallskärmshoppning @se
preferred label: هبوط بالمظلات @ar
preferred label: Paracaidismo @es
preferred label: Fallschirmspringen @de
preferred label: parachuting @en-gb
preferred label: Parachutisme @fr
preferred label: paraquedismo @pt-pt
preferred label: faldskærmsudspring @dk
preferred label: 跳伞 @zh-hans
preferred label: fallskjermhopping
definition: Fallschirmsprung Wettbewerbe: Punktlandungen, Spannweite, Einzel und im Team @de
definition: Jumping from an aeroplane using a parachute, competitions are precision landings, voltige, individual and team @en-gb
definition: De tävlande hoppar ut från ett flygplan och har fallskärm och gör konster i luften eller precisionslandar. Individuellt eller i lag. @se
definition: Saltar de um avião usando um paraquedas. Competições de paraquedismo: precisão de aterragem, volteio, individual ou por equipas. @pt-pt
definition: Saltar de um avião usando um paraquedas. Competições de paraquedismo: precisão de aterragem, volteio, individual ou por equipes. @pt-br
definition: Faldskærmsudspringeren hopper ud af et fly med faldskærm og laver kunst i luften eller præcisionslandinger. Individuelt eller i hold. @dk
definition: 使用降落伞从飞机上跳下。比赛分定点和特技，个人和集体 @zh-hans
definition: Jumping from an airplane using a parachute, competitions are precision landings, voltige, individual and team @en-us
definition: Greiner av fallskjermsporten utan fritt fall der det blir konkurrert i presisjonslanding og andre disiplinar nær bakken.
definition: Grener av fallskjermsporten uten fritt fall og der det konkurreres i presisjonslanding og andre øvelser nær bakken.
in scheme: mediatopic
created: 2009-10-22T02:00:00+00:00
modified: 2021-02-18T12:00:00+00:00
broader: http://cv.iptc.org/newscodes/mediatopic/20000822