rodeio
type: Concept
preferred label: Rodeo @se
preferred label: rodeo @en-gb
preferred label: Rodéo @fr
preferred label: روديو @ar
preferred label: 牛仔竞技 @zh-hans
definition: Disziplin bei der wilde Pferde und Bullen beritten und gezähmt werden @de
definition: A discipline where wild horses or bulls must be mounted and mastered @en-gb
definition: En sport där de tävlande ska hantera vilda hästar, tjurar, kalvar eller getter. @se
definition: Disciplina em que cavalos ou touros selvagens podem ser montados e domados.
definition: Disciplina em que cavalos ou bois selvagens podem ser montados e domados.
definition: En sport, hvor deltagerne skal håndtere vilde heste, tyre, kalve eller geder. @dk
definition: 骑上并控制野马，野牛的比赛 @zh-hans
in scheme: mediatopic
created: 2009-10-22T02:00:00+00:00
modified: 2021-02-18T12:00:00+00:00
broader: http://cv.iptc.org/newscodes/mediatopic/20000822
narrower: http://cv.iptc.org/newscodes/mediatopic/20001018
narrower: http://cv.iptc.org/newscodes/mediatopic/20001019
narrower: http://cv.iptc.org/newscodes/mediatopic/20001020
narrower: http://cv.iptc.org/newscodes/mediatopic/20001021
narrower: http://cv.iptc.org/newscodes/mediatopic/20001022
narrower: http://cv.iptc.org/newscodes/mediatopic/20001023
narrower: http://cv.iptc.org/newscodes/mediatopic/20001024