quatro com timoneiro
type: Concept
preferred label: تجديف رباعي بالدفة @ar
preferred label: coxed four @en-gb
preferred label: Quatre barré (aviron) @fr
preferred label: Fyra med styrman @se
preferred label: Cuatro con timonel (remo) @es
preferred label: Vierer @de
preferred label: firer med styrmand @dk
preferred label: 四人单桨有舵赛艇比赛 @zh-hans
preferred label: firer med styrmann @no-nb
preferred label: firar med styrmann @no-nn
definition: Four person boats with just one oar each and with a team mate to give directions @en-gb
definition: Boot für vier Personen und einem Ruder für jeden mit Steuermann @de
definition: Barco de quatro pessoas com apenas um remo cada uma e com um companheiro de equipa para dar instruções.
definition: Barco de quatro pessoas com apenas um remo cada uma e com um companheiro de equipe para dar instruções.
definition: Firepersoners både med kun een åre til hver person og med en styrmand til at sætte kursen. @dk
definition: 四人单桨有舵赛艇比赛，有一人掌控方向 @zh-hans
in scheme: mediatopic
created: 2009-10-22T02:00:00+00:00
modified: 2021-12-21T12:00:00+00:00
retired: 2015-02-24T12:00:00+00:00
broad match: http://cv.iptc.org/newscodes/subjectcode/15047000
broader: http://cv.iptc.org/newscodes/mediatopic/20001026