Doppelzweier
type: Concept
preferred label: Deux de couple (aviron) @fr
preferred label: تجديف زوجي @ar
preferred label: Dubbelsculler @se
preferred label: Scull double (remo) @es
preferred label: double sculls @en-gb
preferred label: dobbeltsculler @dk
preferred label: 双人双桨赛艇 @zh-hans
definition: Two person boats with two oars each @en-gb
definition: Boot für zwei Personen mit je zwei Rudern
definition: Barco de duas pessoas com dois remos cada uma. @pt-pt
definition: Topersoners båd med to årer hver. @dk
definition: 双人，每人双桨赛艇比赛 @zh-hans
in scheme: mediatopic
created: 2009-10-22T02:00:00+00:00
modified: 2021-12-21T12:00:00+00:00
retired: 2015-02-24T12:00:00+00:00
broader: http://cv.iptc.org/newscodes/mediatopic/20001026