saltos de esqui
type: Concept
definition: Os esquiadores ganham velocidade descendo uma rampa coberta de neve e saltam o mais longe possível, sendo avaliados pela distância coberta, pelo estilo de voo e pela qualidade da receção.
in scheme: mediatopic
created: 2009-10-22T02:00:00+00:00
modified: 2021-02-18T12:00:00+00:00
broader: http://cv.iptc.org/newscodes/mediatopic/20001056