speed skating
type: Concept
preferred label: Eisschnelllauf @de
preferred label: Patinage de vitesse @fr
preferred label: تزلج سريع @ar
preferred label: Patinaje de velocidad @es
preferred label: Skridsko @se
preferred label: patinagem (velocidade) @pt-pt
preferred label: patinação (velocidade) @pt-br
preferred label: hurtigløb på skøjter @dk
preferred label: 速度滑冰 @zh-hans
preferred label: skøyter @no-nb
definition: Zeitrennen, ausgeübt von zwei Läufern zur gleichen Zeit auf einer ovalen Eisbahn @de
definition: Två tävlande i taget åker runt en oval isbana med speciella längdåkningsskridskor på fötterna. De tävlande växlar mellan innerbana och ytterbana. Lopp av olika längd. @se
definition: Timed races competed by two or more skaters at a time on an oval ice track
definition: Corridas disputadas por 2 patinadores em pista oval de gelo. @pt-pt
definition: Tidskørsel, hvor to skøjteløbere med specielle langdistance skøjter, løber på en oval isbane og skifter mellem inderbane og yderbane. @dk
definition: 两个或两个以上的滑冰运动员同时在椭圆形冰道上进行的计时比赛 @zh-hans
definition: Timed races competed by two skaters at a time on an oval ice track
in scheme: mediatopic
created: 2009-10-22T02:00:00+00:00
modified: 2021-03-31T12:00:00+00:00
broader: http://cv.iptc.org/newscodes/mediatopic/20000822