相扑
type: Concept
definition: 一种带仪式感的搏击运动，比拼速度和反应。比赛双方努力将对方摔到标识区域外。一般说来是在日本的块头大的男性之间的比赛
in scheme: mediatopic
created: 2009-10-22T02:00:00+00:00
modified: 2021-02-18T12:00:00+00:00
broader: http://cv.iptc.org/newscodes/mediatopic/20000822