natação
type: Concept
preferred label: سباحة @ar
preferred label: Schwimmen @de
preferred label: swimming @en-gb
preferred label: Natación @es
preferred label: Simning @se
preferred label: Natation @fr
preferred label: svømning @dk
preferred label: 游泳 @zh-hans
preferred label: svømming @no-nb
preferred label: symjing @no-nn
definition: Wassersport bei dem die Wettkämpfer so schnell wie möglich in einem vorgegebenen Stil schwimmen. Sieger ist, wer zuerst ankommt @de
definition: A water sport where contestants swim as fast as possible in a given style and win races by being the first to touch home @en-gb
definition: Tävlingarna sker i speciella bassänger med uppmärkta banor. Bassängerna kan vara långa eller korta. Man tävlar i olika distanser och olika simsätt som bröst, frisim, rygg och medley. Även som stafetter som i simning kallas lagkapp. @se
definition: Desporto aquático em que os atletas nadam o mais rápido possível em determinado estilo.
definition: Esporte aquático em que os atletas nadam o mais rápido possível em determinado estilo.
definition: En vandsport, hvor deltagere svømmer så hurtigt som muligt i en given stil og på en bestemt distance og vinderen er den som er hurtigst. @dk
definition: 水上运动。运动员按要求的泳姿以最快的速度，第一个游到终点并触壁的获胜 @zh-hans
in scheme: mediatopic
created: 2009-10-22T02:00:00+00:00
modified: 2021-02-18T12:00:00+00:00
broader: http://cv.iptc.org/newscodes/mediatopic/20000822
narrower: http://cv.iptc.org/newscodes/mediatopic/20001072
narrower: http://cv.iptc.org/newscodes/mediatopic/20001073
narrower: http://cv.iptc.org/newscodes/mediatopic/20001074
narrower: http://cv.iptc.org/newscodes/mediatopic/20001075
narrower: http://cv.iptc.org/newscodes/mediatopic/20001076
narrower: http://cv.iptc.org/newscodes/mediatopic/20001077
narrower: http://cv.iptc.org/newscodes/mediatopic/20001078
narrower: http://cv.iptc.org/newscodes/mediatopic/20001079
narrower: http://cv.iptc.org/newscodes/mediatopic/20001080
has facet: swimmingtype