backstroke
type: Concept
preferred label: Ryggsim @se
preferred label: Dos @fr
preferred label: Espalda (natación) @es
preferred label: Rückenschwimmen @de
preferred label: سباحة الظهر @ar
preferred label: costas @pt-pt
preferred label: rygcrawl @dk
preferred label: 仰泳 @zh-hans
preferred label: ryggsvømming @no-nb
preferred label: ryggsymjing @no-nn
definition: Schwimmstil auf dem Rücken liegend, Beine bewegen sich in schlagender Bewegung, während die Arme den Schwimmer nach vorne treiben @de
definition: Swimming style, on the back, legs move in flapping motion whilst arms propel the swimmer forward
definition: Estilo de natação em que o nadador, de costas para o fundo, bate as pernas e gira os braços para trás para progredir. @pt-pt
definition: Estilo de nado em que o nadador, de costas para o fundo, bate as pernas e gira os braços para trás para progredir. @pt-br
definition: Svømmedisciplin på ryggen, hvor benene bevæger sig i flappende bevægelse, mens armene driver svømmeren fremad. @dk
definition: 一种泳姿。仰躺在水上。泳者靠腿摆动和手击水推动向前游 @zh-hans
definition: Swimming style, on the back, legs move in flapping motion while arms propel the swimmer forward
in scheme: mediatopic
created: 2009-10-22T02:00:00+00:00
retired: 2015-02-24T12:00:00+00:00
modified: 2021-12-21T12:00:00+00:00
broader: http://cv.iptc.org/newscodes/mediatopic/20001071
broad match: http://cv.iptc.org/newscodes/subjectcode/15062000