规定动作（花样游泳）
type: Concept
definition: 十名裁判根据选手在水中的动作的协调程度和艺术效果对运动员打分。在技术编排上，运动员必须按序完成规定的动作
in scheme: mediatopic
created: 2009-10-22T02:00:00+00:00
modified: 2021-02-18T12:00:00+00:00
broader: http://cv.iptc.org/newscodes/mediatopic/20001175