instalação desportiva
type: Concept
definition: Construção (edifício, estrutura ou recinto) devidamente preparada para receber eventos desportivos.
in scheme: mediatopic
created: 2009-10-22T02:00:00+00:00
modified: 2021-03-31T12:00:00+00:00
broad match: http://cv.iptc.org/newscodes/subjectcode/15000000
broader: http://cv.iptc.org/newscodes/mediatopic/15000000