estatísticas climáticas
type: Concept
preferred label: احصاءات احوال جوية @ar
preferred label: Statistiques météorologiques @fr
preferred label: Estadísticas meteorológicas @es
preferred label: Wetterstatistik @de
preferred label: Väderstatistik @se
preferred label: weather statistic @en-gb
preferred label: vejrstatistik @dk
preferred label: 气象数据 @zh-hans
preferred label: værstatistikk @no-nb
preferred label: vêrstatistikk @no-nn
definition: Données numériques telles que la température, le taux d'humidité, la pression atmosphérique, le niveau de crue ou la variation des marées @fr
definition: Numerical facts about the weather such as temperature, barometric pressure, river levels, humidity or high and low tides @en-gb
definition: Numeriska fakta om vädret, såsom temperatur, hög- och lågtryck, luftfuktighet och liknande. @se
definition: Numerische Daten über das Wetter, wie etwa Temperatur, Luftdruck, Luftfeuchtigkeit, Wasserstände, auch von Flut und Ebbe. @de
definition: Datos numéricos como temperatura, humedad, presión atmosférica, nivel de inundación o variación de la marea @es
definition: Factos numéricos sobre o tempo, como temperatura, pressão atmosférica, níveis dos rios, humidade, marés altas e marés baixas, etc.
definition: Fatos numéricos sobre o tempo, como temperatura, pressão atmosférica, níveis dos rios, umidade, marés altas e marés baixas etc.
definition: Numeriske fakta om vejret som temperatur, barometrisk tryk, flodniveauer, fugtighed eller høj og lavvande. @dk
definition: 有关天气的数值事实，例如温度、气压、河流水位、湿度或涨潮或退潮 @zh-hans
in scheme: mediatopic
created: 2009-10-22T02:00:00+00:00
modified: 2021-02-18T12:00:00+00:00
broader: http://cv.iptc.org/newscodes/mediatopic/17000000