Comédie musicale
type: Concept
preferred label: Musical @de
preferred label: musical @en-gb
preferred label: Musikal @se
preferred label: 歌舞剧 @zh-hans
preferred label: musikal @no-nb
preferred label: مسرح موسيقي @ar
definition: A genre of music theatre in which singing and dancing play an essential part of the storytelling @en-gb
definition: Genre théâtral dans lequel le chant et la danse jouent un rôle essentiel dans la narration
definition: Género teatral en el cual el canto y el baile son parte esencial de la narración @es
definition: Eine Gattung von Musiktheater, in der das Singen und Tanzen ein wesentlicher Teil des Erzählens einer Geschichte sind. @de
definition: Teater där musik och sång är en betydelsefull del av själva historieberättandet. @se
definition: Género de teatro musical no qual o canto e a dança são parte essencial da narrativa. @pt-pt
definition: Gênero de teatro musical no qual o canto e a dança são parte essencial da narrativa. @pt-br
definition: Teater, hvor musik og sang er en vigtig del af selve historien. @dk
definition: 一种舞台音乐剧类型，其中唱歌和跳舞是叙事的重要组成部分 @zh-hans
in scheme: mediatopic
created: 2012-10-04T12:00:00+00:00
modified: 2021-09-30T12:00:00+00:00
broader: http://cv.iptc.org/newscodes/mediatopic/20000029